id,dxpoa1,dxpoa2,dxpoa3,dxpoa4,dxpoa5,dxpoa6,dxpoa7,dxpoa8,dxpoa9,dxpoa10,dxpoa11,dxpoa12,dxpoa13,dxpoa14,dxpoa15,dxpoa16,dxpoa17,dxpoa18,dxpoa19,dxpoa20,dxpoa21,dxpoa22,dxpoa23,dxpoa24,dxpoa25,pr1,pr2,pr3,pr4,pr5,pr6,pr7,pr8,pr9,pr10,pr11,pr12,pr13,pr14,pr15,age,female
1,99665,34400,V145,0413,V0991,2809,32382,56400,5180,2768,59654,570,7140,5990,V6406,V146,V1509,V1251,,,,,,,,3893,5795,,,,,,,,,,,,,,53,1
2,82021,40391,78009,25040,2767,58381,2724,2761,28521,25060,53081,3572,5990,7586,5856,0414,,,,,,,,,,7935,3995,,,,,,,,,,,,,,44,1
3,64511,V270,,,,,,,,,,,,,,,,,,,,,,,,7359,,,,,,,,,,,,,,,25,1
4,5723,30390,2859,3051,53789,2768,2875,5712,2752,5531,45620,,,,,,,,,,,,,,,4233,9904,,,,,,,,,,,,,,39,0
5,03812,71101,2859,07054,5715,99591,2762,2761,5589,78959,2875,5990,,,,,,,,,,,,,,8011,9904,3893,,,,,,,,,,,,,67,1
6,81354,87344,88100,,,,,,,,,,,,,,,,,,,,,,,7932,8659,,,,,,,,,,,,,,43,0
7,57471,7824,0413,2859,2724,7904,2768,6989,5761,,,,,,,,,,,,,,,,,5122,5110,,,,,,,,,,,,,,77,0
8,4552,V850,725,V5865,78321,2875,42731,27651,7140,V5866,2841,,,,,,,,,,,,,,,4513,9905,9904,,,,,,,,,,,,,79,1
9,66121,65841,V270,65971,,,,,,,,,,,,,,,,,,,,,,741,734,,,,,,,,,,,,,,24,1
10,5781,2851,5559,,,,,,,,,,,,,,,,,,,,,,,4523,,,,,,,,,,,,,,,40,0
11,2809,4019,2768,2720,1977,V5866,5781,56089,25000,,,,,,,,,,,,,,,,,4525,4513,9904,,,,,,,,,,,,,77,0
12,53140,79029,2800,,,,,,,,,,,,,,,,,,,,,,,4513,9904,,,,,,,,,,,,,,57,0
13,4254,7354,4019,,,,,,,,,,,,,,,,,,,,,,,7756,,,,,,,,,,,,,,,87,1
14,51881,486,2752,79902,7904,41401,4019,42830,4280,2762,6929,29181,2763,2724,49121,2768,30390,V5866,,,,,,,,9672,9462,,,,,,,,,,,,,,62,0
15,5579,30301,6961,3051,2989,V850,2819,34590,27651,29181,,,,,,,,,,,,,,,,4525,9462,,,,,,,,,,,,,,47,0
16,1540,27800,V5865,71690,2189,V163,,,,,,,,,,,,,,,,,,,,4575,9904,4869,,,,,,,,,,,,,52,1
17,71536,27800,V4365,,,,,,,,,,,,,,,,,,,,,,,8154,,,,,,,,,,,,,,,47,1
18,03811,2867,28529,59389,25000,07054,72291,2638,56409,2761,2768,99591,73028,30480,3241,V0481,V0382,,,,,,,,,0309,0331,3893,3893,,,,,,,,,,,,65,0
19,5579,V850,41401,4019,53081,56081,2875,78321,V1043,V443,,,,,,,,,,,,,,,,4562,,,,,,,,,,,,,,,85,1
20,5307,25000,28860,5715,30390,27651,71945,2859,2720,53082,53010,,,,,,,,,,,,,,,4513,,,,,,,,,,,,,,,42,0
21,53783,4280,V8741,V146,V153,5533,2111,V1241,53089,78720,,,,,,,,,,,,,,,,4516,,,,,,,,,,,,,,,82,1
22,9351,5303,78720,5715,53789,45620,,,,,,,,,,,,,,,,,,,,9802,,,,,,,,,,,,,,,64,0
23,V5811,23874,3004,30393,05412,20501,,,,,,,,,,,,,,,,,,,,9925,,,,,,,,,,,,,,,52,1
24,5307,2851,41401,412,40390,4280,2720,42731,5859,V1254,5849,,,,,,,,,,,,,,,4513,9904,,,,,,,,,,,,,,87,1
25,4280,2841,5859,2859,496,V4501,7824,V1046,42731,53081,1977,4148,5119,,,,,,,,,,,,,9904,,,,,,,,,,,,,,,87,0
26,72271,V1051,53081,25002,2859,40490,59654,5849,V1251,5859,V1582,2761,591,1985,49320,311,2749,,,,,,,,,0309,9904,,,,,,,,,,,,,,65,0
27,99673,40391,2767,V5866,28521,V1254,25000,V4511,2724,49320,2948,V113,5856,,,,,,,,,,,,,3949,3995,,,,,,,,,,,,,,57,0
28,65971,V270,,,,,,,,,,,,,,,,,,,,,,,,7359,,,,,,,,,,,,,,,30,1
29,57460,486,28521,58381,25040,3572,7586,53081,5990,25060,5856,0417,7993,V4511,,,,,,,,,,,,5123,3995,,,,,,,,,,,,,,42,1
30,2662,7813,2761,25001,49390,311,8244,30981,5849,30500,7210,8260,4019,3559,,,,,,,,,,,,7916,0331,,,,,,,,,,,,,,52,1
31,64421,65261,V272,65101,,,,,,,,,,,,,,,,,,,,,,741,,,,,,,,,,,,,,,34,1
32,4280,311,5990,42731,49121,4439,2724,4589,515,41071,,,,,,,,,,,,,,,,9390,,,,,,,,,,,,,,,87,1
33,0389,25060,V854,43820,7824,99592,5724,496,34831,32723,570,5990,5849,3572,27801,4019,07070,2768,51889,71949,78720,43882,,,,311,9672,9604,3995,9907,3895,,,,,,,,,,66,1
34,65811,V0251,64811,V270,2449,64891,,,,,,,,,,,,,,,,,,,,7359,734,,,,,,,,,,,,,,29,1
35,2761,78830,23871,2948,23875,2749,4019,70724,78720,70703,25000,2859,,,,,,,,,,,,,,8622,9904,,,,,,,,,,,,,,87,1
36,431,4254,41401,4280,4019,42731,5990,25000,71595,2724,3485,07054,V4502,,,,,,,,,,,,,4311,8841,3893,9907,9906,9671,,,,,,,,,,79,1
37,5602,4019,3659,25000,,,,,,,,,,,,,,,,,,,,,,4576,4523,,,,,,,,,,,,,,93,1
38,65971,65251,64521,V270,66001,,,,,,,,,,,,,,,,,,,,,7279,,,,,,,,,,,,,,,32,1
39,73008,99661,3004,V1581,78052,4019,25000,70715,4219,,,,,,,,,,,,,,,,,8607,8191,,,,,,,,,,,,,,62,0
40,03812,51881,4280,00845,5859,5849,2720,4111,25000,2761,49392,40390,486,2859,99592,78720,7993,V1582,60000,2875,42731,,,,,311,9672,3895,3995,,,,,,,,,,,,78,0
41,5722,5789,53081,5728,30393,53789,28529,78959,25062,2874,5363,2761,5119,51889,5712,2724,78065,V1006,V5867,V153,V8741,,,,,4513,5491,9904,,,,,,,,,,,,,72,0
42,65421,V270,,,,,,,,,,,,,,,,,,,,,,,,7359,,,,,,,,,,,,,,,28,1
43,52489,,,,,,,,,,,,,,,,,,,,,,,,,7664,,,,,,,,,,,,,,,22,0
44,5244,,,,,,,,,,,,,,,,,,,,,,,,,7664,,,,,,,,,,,,,,,23,1
45,53011,2762,2859,V8741,5533,78720,4019,25000,27651,V1043,1976,,,,,,,,,,,,,,,4516,,,,,,,,,,,,,,,72,1
46,53551,34590,6262,2851,,,,,,,,,,,,,,,,,,,,,,4516,,,,,,,,,,,,,,,37,1
47,52406,32723,4019,27800,52410,,,,,,,,,,,,,,,,,,,,,7664,,,,,,,,,,,,,,,57,0
48,51881,4820,4439,27800,0417,5859,5990,41400,00845,2809,51181,1629,40390,48241,2749,5533,42731,V4581,70709,70722,,,,,,311,9604,9672,,,,,,,,,,,,,87,1
49,51881,486,311,53081,5853,2449,2948,49121,79902,40390,2859,42731,30390,41071,1734,V462,V1254,V5865,,,,,,,,9904,9390,,,,,,,,,,,,,,72,1
50,6268,2800,,,,,,,,,,,,,,,,,,,,,,,,6909,9904,,,,,,,,,,,,,,26,1
